Target
Retinaldehyde-binding protein 1
Ligand
BDBM338950
Substrate
Meas. Tech.
Isomerase Assay
IC50
<1000±n/a nM
Citation
 Scott, ILKuksa, VAGall, AOrme, MWGage, JLittle, Jr., TLJiang, QRossiter, LMMcGee, Jr., KFKubota, R Styrenyl derivative compounds for treating ophthalmic diseases and disorders US Patent  US10201545 Publication Date 2/12/2019 
Target
Name:
Retinaldehyde-binding protein 1
Synonyms:
CRALBP RLBP1 | RLBP1_HUMAN
Type:
Enzyme Catalytic Domain
Mol. Mass.:
36462.25
Organism:
Homo sapiens (Human)
Description:
P12271
Residue:
317
  
Inhibitor
Name:
BDBM338950
Synonyms:
(S,E)-3-amino-1-(3-(2-(2,6,6-trimethylcyclohex-1- enyl)vinyl)phenyl)propan-1-ol | US10201545, Compound 105
Type:
Small organic molecule
Emp. Form.:
C20H29NO
Mol. Mass.:
299.4504
SMILES:
CC1=C(\C=C\c2cccc(c2)[C@H](O)CCN)C(C)(C)CCC1
: