Target
Retinaldehyde-binding protein 1
Ligand
BDBM338994
Substrate
Meas. Tech.
Isomerase Assay
IC50
<10000±n/a nM
Citation
 Scott, ILKuksa, VAGall, AOrme, MWGage, JLittle, Jr., TLJiang, QRossiter, LMMcGee, Jr., KFKubota, R Styrenyl derivative compounds for treating ophthalmic diseases and disorders US Patent  US10201545 Publication Date 2/12/2019 
Target
Name:
Retinaldehyde-binding protein 1
Synonyms:
CRALBP RLBP1 | RLBP1_HUMAN
Type:
Enzyme Catalytic Domain
Mol. Mass.:
36462.25
Organism:
Homo sapiens (Human)
Description:
P12271
Residue:
317
  
Inhibitor
Name:
BDBM338994
Synonyms:
(Z)-3-(3-(2-(3-methoxynaphthalen-2- yl)vinyl)phenyl)propan-1-amine | US10201545, Compound 96
Type:
Small organic molecule
Emp. Form.:
C22H23NO
Mol. Mass.:
317.4241
SMILES:
COc1cc2ccccc2cc1\C=C/c1cccc(CCCN)c1
: