Target
P2Y purinoceptor 1
Ligand
BDBM260826
Substrate
Meas. Tech.
Scintillation Proximity Assay (SPA)
pH
7.4±n/a
Temperature
298.15±n/a K
Ki
5.00±n/a nM
Comments
extracted
Citation
 LHeureux, A 7-hydroxy-indolinyl antagonists of P2Y1 receptor US Patent  US9540323 Publication Date 1/10/2017 
Target
Name:
P2Y purinoceptor 1
Synonyms:
ATP receptor P2RY1_HUMAN P2Y1 Purinergic receptor P2Y1
Type:
Enzyme
Mol. Mass.:
42090.25
Organism:
Homo sapiens (Human)
Description:
P47900
Residue:
373
  
Inhibitor
Name:
BDBM260826
Synonyms:
US9540323, 12 | US9540323, example 12
Type:
Small organic molecule
Emp. Form.:
C25H21F6N3O3
Mol. Mass.:
525.443
SMILES:
CC1(C)CN(c2c1c(ccc2O)C(F)(F)F)c1ccccc1NC(=O)Nc1ccc(OC(F)(F)F)cc1
: