Target
Nuclear receptor ROR-gamma
Ligand
BDBM339047
Substrate
Meas. Tech.
ThermoFluor Assay
Kd
3600±n/a nM
Citation
 Leonard, KABarbay, KEdwards, JPKreutter, KDKummer, DAMaharoof, UNishimura, RUrbanski, MVenkatesan, HWang, AWolin, RLWoods, CRFourie, AXue, XCummings, MDMcClure, KTanis, V Quinolinyl modulators of RORγt US Patent  US10201546 Publication Date 2/12/2019 
Target
Name:
Nuclear receptor ROR-gamma
Synonyms:
NR1F3 Nuclear receptor ROR-gamma (RORC) RAR-related orphan receptor C (RORc) RORG RZRG Retinoid-related orphan receptor-gamma (RORc)
Type:
Enzyme Catalytic Domain
Mol. Mass.:
58218.40
Organism:
Homo sapiens (Human)
Description:
P51449
Residue:
518
  
Inhibitor
Name:
BDBM339047
Synonyms:
US10201546, Example 11c
Type:
Small organic molecule
Emp. Form.:
C25H27ClN2O3
Mol. Mass.:
438.946
SMILES:
COc1nc2ccc(cc2c(Cl)c1C)[C@](O)(C1CCN(CC1)C(C)=O)c1ccccc1
: