Target
Nuclear receptor ROR-gamma
Ligand
BDBM339127
Substrate
Meas. Tech.
ThermoFluor Assay
Kd
1100±n/a nM
Citation
 Leonard, KABarbay, KEdwards, JPKreutter, KDKummer, DAMaharoof, UNishimura, RUrbanski, MVenkatesan, HWang, AWolin, RLWoods, CRFourie, AXue, XCummings, MDMcClure, KTanis, V Quinolinyl modulators of RORγt US Patent  US10201546 Publication Date 2/12/2019 
Target
Name:
Nuclear receptor ROR-gamma
Synonyms:
NR1F3 Nuclear receptor ROR-gamma (RORC) RAR-related orphan receptor C (RORc) RORG RZRG Retinoid-related orphan receptor-gamma (RORc)
Type:
Enzyme Catalytic Domain
Mol. Mass.:
58218.40
Organism:
Homo sapiens (Human)
Description:
P51449
Residue:
518
  
Inhibitor
Name:
BDBM339127
Synonyms:
US10201546, Example 62
Type:
Small organic molecule
Emp. Form.:
C27H29ClN6O4
Mol. Mass.:
537.01
SMILES:
COc1nc2ccc(cc2c(Cl)c1OCc1c(C)noc1C)C(O)(c1cnc(C)n1C)c1cnc(C)n1C
: