Target
Nuclear receptor ROR-gamma
Ligand
BDBM339180
Substrate
Meas. Tech.
ThermoFluor Assay
Kd
200±n/a nM
Citation
 Leonard, KABarbay, KEdwards, JPKreutter, KDKummer, DAMaharoof, UNishimura, RUrbanski, MVenkatesan, HWang, AWolin, RLWoods, CRFourie, AXue, XCummings, MDMcClure, KTanis, V Quinolinyl modulators of RORγt US Patent  US10201546 Publication Date 2/12/2019 
Target
Name:
Nuclear receptor ROR-gamma
Synonyms:
NR1F3 Nuclear receptor ROR-gamma (RORC) RAR-related orphan receptor C (RORc) RORG RZRG Retinoid-related orphan receptor-gamma (RORc)
Type:
Enzyme Catalytic Domain
Mol. Mass.:
58218.40
Organism:
Homo sapiens (Human)
Description:
P51449
Residue:
518
  
Inhibitor
Name:
BDBM339180
Synonyms:
US10201546, Example 90a
Type:
Small organic molecule
Emp. Form.:
C25H21Cl2F3N4O2
Mol. Mass.:
537.361
SMILES:
Cn1cncc1C(O)(c1ccc(Cl)cc1)c1ccc2nc(N3CCC3)c(OCC(F)(F)F)c(Cl)c2c1
: