Target
Nuclear receptor ROR-gamma
Ligand
BDBM339200
Substrate
Meas. Tech.
RORgammat ThermoFluor Assay
IC50
12.0±n/a nM
Citation
 Leonard, KABarbay, KEdwards, JPKreutter, KDKummer, DAMaharoof, UNishimura, RUrbanski, MVenkatesan, HWang, AWolin, RLWoods, CRFourie, AXue, XCummings, MDMcClure, KTanis, V Quinolinyl modulators of RORγt US Patent  US10201546 Publication Date 2/12/2019 
Target
Name:
Nuclear receptor ROR-gamma
Synonyms:
NR1F3 Nuclear receptor ROR-gamma (RORC) RAR-related orphan receptor C (RORc) RORG RZRG Retinoid-related orphan receptor-gamma (RORc)
Type:
Enzyme Catalytic Domain
Mol. Mass.:
58218.40
Organism:
Homo sapiens (Human)
Description:
P51449
Residue:
518
  
Inhibitor
Name:
BDBM339200
Synonyms:
US10201546, Example 100c
Type:
Small organic molecule
Emp. Form.:
C28H26ClF6N5O2
Mol. Mass.:
613.982
SMILES:
COc1nc2ccc(cc2c(Cl)c1CN1CCC(CC1)C(F)(F)F)[C@@](O)(c1cncn1C)c1ccnc(c1)C(F)(F)F
: