Target
Tyrosine-protein phosphatase non-receptor type 2
Ligand
BDBM13954
Substrate
BDBM13466
Meas. Tech.
PTP1B and TCPTP Inhibition Assay
pH
7.5±n/a
Temperature
295.15±n/a K
Ki
49±6 nM
Citation
 Szczepankiewicz, BGLiu, GHajduk, PJAbad-Zapatero, CPei, ZXin, ZLubben, THTrevillyan, JMStashko, MABallaron, SJLiang, HHuang, FHutchins, CWFesik, SWJirousek, MR Discovery of a potent, selective protein tyrosine phosphatase 1B inhibitor using a linked-fragment strategy. J Am Chem Soc 125:4087-96 (2003)  
Target
Name:
Tyrosine-protein phosphatase non-receptor type 2
Synonyms:
PTN2_HUMAN PTPT T-cell protein-tyrosine phosphatase TCPTP Tyrosine-protein phosphatase non-receptor type 2 (TC-PTP)
Type:
Protein
Mol. Mass.:
48481.80
Organism:
Homo sapiens (Human)
Description:
P17706
Residue:
415
  
Inhibitor
Name:
BDBM13954
Synonyms:
3-({5-[(2S)-3-{4-[(2-carboxyphenyl)amidoformic acid]naphthalen-1-yl}-2-acetamidopropanamido]pentyl}oxy)naphthalene-2-carboxylic acid linked-fragment derived compound 23
Type:
Small organic molecule
Emp. Form.:
C40H37N3O10
Mol. Mass.:
719.7359
SMILES:
CC(=O)N[C@@H](Cc1ccc(N(C(=O)C(O)=O)c2ccccc2C(O)=O)c2ccccc12)C(=O)NCCCCCOc1cc2ccccc2cc1C(O)=O
:
Substrate
Name:
BDBM13466
Synonyms:
4-Nitrophenyl phosphate disodium salt hexahydrate disodium (4-nitrophenyl) phosphate | para-nitrophenyl phosphate (pNPP)
Type:
Small organic molecule
Emp. Form.:
C6H4NO6P
Mol. Mass.:
217.0739
SMILES:
[O-][N+](=O)c1ccc(O[P+]([O-])([O-])[O-])cc1
: