Target
Tyrosine-protein phosphatase non-receptor type 2
Ligand
BDBM13966
Substrate
BDBM13466
Meas. Tech.
PTP1B and TCPTP Inhibition Assay
Ki
13000±n/a nM
Citation
 Liu, GSzczepankiewicz, BGPei, ZJanowick, DAXin, ZHajduk, PJAbad-Zapatero, CLiang, HHutchins, CWFesik, SWBallaron, SJStashko, MALubben, TMika, AKZinker, BATrevillyan, JMJirousek, MR Discovery and structure-activity relationship of oxalylarylaminobenzoic acids as inhibitors of protein tyrosine phosphatase 1B. J Med Chem 46:2093-103 (2003)  
Target
Name:
Tyrosine-protein phosphatase non-receptor type 2
Synonyms:
PTN2_HUMAN PTPT T-cell protein-tyrosine phosphatase TCPTP Tyrosine-protein phosphatase non-receptor type 2 (TC-PTP)
Type:
Protein
Mol. Mass.:
48481.80
Organism:
Homo sapiens (Human)
Description:
P17706
Residue:
415
  
Inhibitor
Name:
BDBM13966
Synonyms:
2-({4-[(2S)-2-{[(tert-butoxy)carbonyl]amino}-2-(pentylcarbamoyl)ethyl]phenyl}amidoformic acid)benzoic acid Oxalylarylaminobenzoic Acid Analog 18
Type:
Small organic molecule
Emp. Form.:
C28H35N3O8
Mol. Mass.:
541.5928
SMILES:
CCCCCNC(=O)[C@H](Cc1ccc(cc1)N(C(=O)C(O)=O)c1ccccc1C(O)=O)NC(=O)OC(C)(C)C
:
Substrate
Name:
BDBM13466
Synonyms:
4-Nitrophenyl phosphate disodium salt hexahydrate disodium (4-nitrophenyl) phosphate | para-nitrophenyl phosphate (pNPP)
Type:
Small organic molecule
Emp. Form.:
C6H4NO6P
Mol. Mass.:
217.0739
SMILES:
[O-][N+](=O)c1ccc(O[P+]([O-])([O-])[O-])cc1
: