Target
Tyrosine-protein phosphatase non-receptor type 2
Ligand
BDBM13971
Substrate
BDBM13466
Meas. Tech.
PTP1B and TCPTP Inhibition Assay
Ki
900±n/a nM
Citation
 Liu, GSzczepankiewicz, BGPei, ZJanowick, DAXin, ZHajduk, PJAbad-Zapatero, CLiang, HHutchins, CWFesik, SWBallaron, SJStashko, MALubben, TMika, AKZinker, BATrevillyan, JMJirousek, MR Discovery and structure-activity relationship of oxalylarylaminobenzoic acids as inhibitors of protein tyrosine phosphatase 1B. J Med Chem 46:2093-103 (2003)  
Target
Name:
Tyrosine-protein phosphatase non-receptor type 2
Synonyms:
PTN2_HUMAN PTPT T-cell protein-tyrosine phosphatase TCPTP Tyrosine-protein phosphatase non-receptor type 2 (TC-PTP)
Type:
Protein
Mol. Mass.:
48481.80
Organism:
Homo sapiens (Human)
Description:
P17706
Residue:
415
  
Inhibitor
Name:
BDBM13971
Synonyms:
1:1 racemic mixture 2-{[4-(2-Acetylamino-2-pentylcarbamoylethyl)-2-ethylphenyl]oxalylamino}benzoic Acid Oxalylarylaminobenzoic Acid Analog 12b | oxalyl-aryl-amino benzoic acid-based inhibitor 2
Type:
Small organic molecule
Emp. Form.:
C27H33N3O7
Mol. Mass.:
511.5668
SMILES:
CCCCCNC(=O)C(Cc1ccc(N(C(=O)C(O)=O)c2ccccc2C(O)=O)c(CC)c1)NC(C)=O
:
Substrate
Name:
BDBM13466
Synonyms:
4-Nitrophenyl phosphate disodium salt hexahydrate disodium (4-nitrophenyl) phosphate | para-nitrophenyl phosphate (pNPP)
Type:
Small organic molecule
Emp. Form.:
C6H4NO6P
Mol. Mass.:
217.0739
SMILES:
[O-][N+](=O)c1ccc(O[P+]([O-])([O-])[O-])cc1
: