Target
Tyrosine-protein phosphatase non-receptor type 1 [1-298]
Ligand
BDBM13978
Substrate
BDBM13466
Meas. Tech.
PTP1B and TCPTP Inhibition Assay
pH
7.5±n/a
Temperature
295.15±n/a K
Ki
6100±0.2 nM
Citation
 Xin, ZLiu, GAbad-Zapatero, CPei, ZSzczepankiewicz, BGLi, XZhang, THutchins, CWHajduk, PJBallaron, SJStashko, MALubben, THTrevillyan, JMJirousek, MR Identification of a monoacid-based, cell permeable, selective inhibitor of protein tyrosine phosphatase 1B. Bioorg Med Chem Lett 13:3947-50 (2003)  
Target
Name:
Tyrosine-protein phosphatase non-receptor type 1 [1-298]
Synonyms:
PTN1_HUMAN PTP1B PTPase 1B Tyrosine-protein phosphatase, non-receptor type 1
Type:
Enzyme
Mol. Mass.:
34670.65
Organism:
Homo sapiens (Human)
Description:
The catalytic domain of PTP 1B (residues 1-298) was expressed and purified from E. coli.
Residue:
298
  
Inhibitor
Name:
BDBM13978
Synonyms:
({4-[2-acetamido-2-({4-[3-hydroxy-2-(methoxycarbonyl)phenoxy]butyl}carbamoyl)ethyl]phenyl}carbamoyl)formic acid phosphotyrosyl mimetic 8a
Type:
Small organic molecule
Emp. Form.:
C25H29N3O9
Mol. Mass.:
515.5125
SMILES:
COC(=O)c1c(O)cccc1OCCCCNC(=O)C(Cc1ccc(NC(=O)C(O)=O)cc1)NC(C)=O
:
Substrate
Name:
BDBM13466
Synonyms:
4-Nitrophenyl phosphate disodium salt hexahydrate disodium (4-nitrophenyl) phosphate | para-nitrophenyl phosphate (pNPP)
Type:
Small organic molecule
Emp. Form.:
C6H4NO6P
Mol. Mass.:
217.0739
SMILES:
[O-][N+](=O)c1ccc(O[P+]([O-])([O-])[O-])cc1
: