Target
Isocitrate dehydrogenase [NADP] cytoplasmic [R132H]
Ligand
BDBM339471
Substrate
Meas. Tech.
In Vitro Assays for IDH1m
IC50
5500±n/a nM
Citation
 Popovici-Muller, JSalituro, FGSaunders, JOTravins, JYan, S Therapeutic compounds and compositions US Patent  US10202339 Publication Date 2/12/2019 
Target
Name:
Isocitrate dehydrogenase [NADP] cytoplasmic [R132H]
Synonyms:
Cytosolic NADP-isocitrate dehydrogenase (IDH1)(R132H) IDH1 R132H IDHC_HUMAN Isocitrate dehydrogenase 1 mutant (R132H) Isocitrate dehydrogenase [NADP] cytoplasmic (IDH1)(R132H) PICD
Type:
Protein
Mol. Mass.:
46641.74
Organism:
Homo sapiens (Human)
Description:
Human IDH1 R132H (SEQ ID No. 2 in patent). First three are removed. Google patent parsed wrong.
Residue:
414
  
Inhibitor
Name:
BDBM339471
Synonyms:
US10202339, Compound 249
Type:
Small organic molecule
Emp. Form.:
C21H20ClN3O3S
Mol. Mass.:
429.92
SMILES:
Cc1cccc(NC(=O)Nc2ccc(C)c(c2)S(=O)(=O)Nc2ccc(Cl)cc2)c1
: