Target
Isocitrate dehydrogenase [NADP], mitochondrial [R140Q]
Ligand
BDBM339741
Substrate
Meas. Tech.
IDH2 Enzymatic Assay
IC50
550±n/a nM
Citation
 Popovici-Muller, JSalituro, FGSaunders, JOTravins, JYan, S Therapeutic compounds and compositions US Patent  US10202339 Publication Date 2/12/2019 
Target
Name:
Isocitrate dehydrogenase [NADP], mitochondrial [R140Q]
Synonyms:
IDH2 IDHP_HUMAN | idh2 r140q
Type:
Enzyme Catalytic Domain
Mol. Mass.:
50823.17
Organism:
Homo sapiens (Human)
Description:
P48735 (R140Q)
Residue:
452
  
Inhibitor
Name:
BDBM339741
Synonyms:
US10202339, Compound 186
Type:
Small organic molecule
Emp. Form.:
C21H16F6N4O4S
Mol. Mass.:
534.432
SMILES:
FC(F)(F)CNS(=O)(=O)c1ccc(Oc2cccnc2)c(NC(=O)Nc2cccc(c2)C(F)(F)F)c1
: