Target
Ceramide glucosyltransferase
Ligand
BDBM339781
Substrate
Meas. Tech.
MDR1-MDCKII Assay
IC50
24.0±n/a nM
Citation
 Larsen, SDAbe, AShu, LWilson, MWKeep, RFSun, DShayman, JA Glucosylceramide synthase inhibitors and therapeutic methods using the same US Patent  US10202340 Publication Date 2/12/2019 
Target
Name:
Ceramide glucosyltransferase
Synonyms:
CEGT_HUMAN GLCT-1 UDP-glucose ceramide glucosyltransferase UGCG
Type:
PROTEIN
Mol. Mass.:
44859.25
Organism:
Homo sapiens (Human)
Description:
ChEMBL_1435474
Residue:
394
  
Inhibitor
Name:
BDBM339781
Synonyms:
US10202340, Example control
Type:
Small organic molecule
Emp. Form.:
C26H32N2O4
Mol. Mass.:
436.5433
SMILES:
O[C@@H]([C@@H](CN1CCCC1)NC(=O)CC1Cc2ccccc2C1)c1ccc2OCCOc2c1
: