Target
Ceramide glucosyltransferase
Ligand
BDBM339782
Substrate
Meas. Tech.
MDR1-MDCKII Assay
IC50
9.40±n/a nM
Citation
 Larsen, SDAbe, AShu, LWilson, MWKeep, RFSun, DShayman, JA Glucosylceramide synthase inhibitors and therapeutic methods using the same US Patent  US10202340 Publication Date 2/12/2019 
Target
Name:
Ceramide glucosyltransferase
Synonyms:
CEGT_HUMAN GLCT-1 UDP-glucose ceramide glucosyltransferase UGCG
Type:
PROTEIN
Mol. Mass.:
44859.25
Organism:
Homo sapiens (Human)
Description:
ChEMBL_1435474
Residue:
394
  
Inhibitor
Name:
BDBM339782
Synonyms:
US10202340, Example 1
Type:
Small organic molecule
Emp. Form.:
C25H31FN2O3
Mol. Mass.:
426.5236
SMILES:
COc1ccc(cc1F)[C@@H](O)[C@@H](CN1CCCC1)NC(=O)CC1Cc2ccccc2C1
: