Target
Ceramide glucosyltransferase
Ligand
BDBM339794
Substrate
Meas. Tech.
WT-MDCK Assay
IC50
11.0±n/a nM
Citation
 Larsen, SDAbe, AShu, LWilson, MWKeep, RFSun, DShayman, JA Glucosylceramide synthase inhibitors and therapeutic methods using the same US Patent  US10202340 Publication Date 2/12/2019 
Target
Name:
Ceramide glucosyltransferase
Synonyms:
CEGT_HUMAN GLCT-1 UDP-glucose ceramide glucosyltransferase UGCG
Type:
PROTEIN
Mol. Mass.:
44859.25
Organism:
Homo sapiens (Human)
Description:
ChEMBL_1435474
Residue:
394
  
Inhibitor
Name:
BDBM339794
Synonyms:
US10202340, Example 13
Type:
Small organic molecule
Emp. Form.:
C26H34N2O3
Mol. Mass.:
422.5598
SMILES:
COc1ccc(cc1)[C@@H](O)[C@@H](CN1CCCC1)NC(=O)CC1CCCc2ccccc12
: