Target
Sodium channel protein type 9 subunit alpha
Ligand
BDBM196443
Substrate
Meas. Tech.
FLIPR Assay
IC50
481±42 nM
Citation
 Kyle, DJNi, CTafesse, LYao, J Aryl substituted indoles and the use thereof US Patent  US10202344 Publication Date 2/12/2019 
Target
Name:
Sodium channel protein type 9 subunit alpha
Synonyms:
NENA Peripheral sodium channel 1 SCN9A_HUMAN Voltage-gated sodium channel subunit Nav1.7 hNE-Na
Type:
Protein
Mol. Mass.:
226375.97
Organism:
Homo sapiens (Human)
Description:
Q15858
Residue:
1988
  
Inhibitor
Name:
BDBM196443
Synonyms:
US10202344, Compound 7 | US9212139, 7
Type:
Small organic molecule
Emp. Form.:
C25H24N2O3
Mol. Mass.:
400.4697
SMILES:
CCOC(=O)C(N)Cc1c[nH]c2ccc(cc12)-c1ccc(Oc2ccccc2)cc1
: