Target
Sodium channel protein type 9 subunit alpha
Ligand
BDBM196453
Substrate
Meas. Tech.
Electrophysiology Assay
Ki
1310±n/a nM
Citation
 Kyle, DJNi, CTafesse, LYao, J Aryl substituted indoles and the use thereof US Patent  US10202344 Publication Date 2/12/2019 
Target
Name:
Sodium channel protein type 9 subunit alpha
Synonyms:
NENA Peripheral sodium channel 1 SCN9A_HUMAN Voltage-gated sodium channel subunit Nav1.7 hNE-Na
Type:
Protein
Mol. Mass.:
226375.97
Organism:
Homo sapiens (Human)
Description:
Q15858
Residue:
1988
  
Inhibitor
Name:
BDBM196453
Synonyms:
US10202344, Compound 45 | US9212139, 45
Type:
Small organic molecule
Emp. Form.:
C28H29N3O3
Mol. Mass.:
455.5482
SMILES:
CN(C)CCc1cn(-c2ccc(Oc3ccccc3)cc2)c2ccc(C[C@H]3COC(=O)N3)cc12
: