Target
Sodium channel protein type 9 subunit alpha
Ligand
BDBM196464
Substrate
Meas. Tech.
Electrophysiology Assay
Ki
920±n/a nM
Citation
 Kyle, DJNi, CTafesse, LYao, J Aryl substituted indoles and the use thereof US Patent  US10202344 Publication Date 2/12/2019 
Target
Name:
Sodium channel protein type 9 subunit alpha
Synonyms:
NENA Peripheral sodium channel 1 SCN9A_HUMAN Voltage-gated sodium channel subunit Nav1.7 hNE-Na
Type:
Protein
Mol. Mass.:
226375.97
Organism:
Homo sapiens (Human)
Description:
Q15858
Residue:
1988
  
Inhibitor
Name:
BDBM196464
Synonyms:
US10202344, Compound 74 | US9212139, 74
Type:
Small organic molecule
Emp. Form.:
C26H26FNO5
Mol. Mass.:
451.4867
SMILES:
OC[C@@H](O)Cc1cn(C[C@H](O)CO)c2ccc(cc12)-c1ccc(Oc2ccc(F)cc2)cc1
: