Target
Sodium channel protein type 9 subunit alpha
Ligand
BDBM196476
Substrate
Meas. Tech.
Electrophysiology Assay
Ki
300±n/a nM
Citation
 Kyle, DJNi, CTafesse, LYao, J Aryl substituted indoles and the use thereof US Patent  US10202344 Publication Date 2/12/2019 
Target
Name:
Sodium channel protein type 9 subunit alpha
Synonyms:
NENA Peripheral sodium channel 1 SCN9A_HUMAN Voltage-gated sodium channel subunit Nav1.7 hNE-Na
Type:
Protein
Mol. Mass.:
226375.97
Organism:
Homo sapiens (Human)
Description:
Q15858
Residue:
1988
  
Inhibitor
Name:
BDBM196476
Synonyms:
US10202344, Compound 122 | US9212139, 122
Type:
Small organic molecule
Emp. Form.:
C24H21FN2O4
Mol. Mass.:
420.4329
SMILES:
NC(=O)c1cccc2n(cc(C[C@H](O)CO)c12)-c1ccc(Oc2ccc(F)cc2)cc1
: