Target
Sodium channel protein type 9 subunit alpha
Ligand
BDBM196488
Substrate
Meas. Tech.
Electrophysiology Assay
Ki
170±n/a nM
Citation
 Kyle, DJNi, CTafesse, LYao, J Aryl substituted indoles and the use thereof US Patent  US10202344 Publication Date 2/12/2019 
Target
Name:
Sodium channel protein type 9 subunit alpha
Synonyms:
NENA Peripheral sodium channel 1 SCN9A_HUMAN Voltage-gated sodium channel subunit Nav1.7 hNE-Na
Type:
Protein
Mol. Mass.:
226375.97
Organism:
Homo sapiens (Human)
Description:
Q15858
Residue:
1988
  
Inhibitor
Name:
BDBM196488
Synonyms:
US10202344, Compound 175 | US9212139, 175
Type:
Small organic molecule
Emp. Form.:
C23H19N3O3
Mol. Mass.:
385.4153
SMILES:
OC[C@@H](O)Cc1cn(-c2ccc(Oc3ccc(cc3)C#N)cc2)c2cccnc12
: