Target
Prostaglandin E2 receptor EP4 subtype
Ligand
BDBM202305
Substrate
Meas. Tech.
cAMP Assay
pH
7.4±n/a
Temperature
298.15±n/a K
Ki
1154±n/a nM
Comments
extracted
Citation
 Ngo, VXOld, DWBurk, RM 15-aryl prostaglandins as EP4 agonists, and methods of use thereof US Patent  US9540357 Publication Date 1/10/2017 
Target
Name:
Prostaglandin E2 receptor EP4 subtype
Synonyms:
PE2R4_HUMAN PGE2 receptor EP4 subtype PTGER4 Prostanoid EP4 receptor
Type:
Enzyme
Mol. Mass.:
53134.53
Organism:
Homo sapiens (Human)
Description:
P35408
Residue:
488
  
Inhibitor
Name:
BDBM202305
Synonyms:
US9540357, example 7 | US9540357, example 8
Type:
Small organic molecule
Emp. Form.:
C30H31NO4
Mol. Mass.:
469.5714
SMILES:
Cc1ccccc1-c1cccc(c1)C(O)\C=C\[C@H]1CCC(=O)N1CCCc1ccc(cc1)C(O)=O
: