Target
Prostaglandin E2 receptor EP4 subtype
Ligand
BDBM202345
Substrate
Meas. Tech.
cAMP Assay
pH
7.4±n/a
Temperature
298.15±n/a K
Ki
130±n/a nM
Comments
extracted
Citation
 Ngo, VXOld, DWBurk, RM 15-aryl prostaglandins as EP4 agonists, and methods of use thereof US Patent  US9540357 Publication Date 1/10/2017 
Target
Name:
Prostaglandin E2 receptor EP4 subtype
Synonyms:
PE2R4_HUMAN PGE2 receptor EP4 subtype PTGER4 Prostanoid EP4 receptor
Type:
Enzyme
Mol. Mass.:
53134.53
Organism:
Homo sapiens (Human)
Description:
P35408
Residue:
488
  
Inhibitor
Name:
BDBM202345
Synonyms:
US9540357, example 24 | US9540357, example 25
Type:
Small organic molecule
Emp. Form.:
C32H34ClNO4
Mol. Mass.:
532.07
SMILES:
CCCc1cc(Cl)ccc1-c1cccc(c1)C(O)\C=C\[C@H]1CCC(=O)N1CCCc1ccc(cc1)C(O)=O
: