Target
cAMP-dependent protein kinase catalytic subunit alpha [L49I]
Ligand
BDBM14030
Substrate
Kemptide
Meas. Tech.
Kinase Activity Assay
pH
6.8±n/a
Temperature
298.15±n/a K
IC50
10300±2599 nM
Km
10000±n/a nM
Citation
 Bonn, SHerrero, SBreitenlechner, CBErlbruch, ALehmann, WEngh, RAGassel, MBossemeyer, D Structural analysis of protein kinase A mutants with Rho-kinase inhibitor specificity. J Biol Chem 281:24818-30 (2006)  
Target
Name:
cAMP-dependent protein kinase catalytic subunit alpha [L49I]
Synonyms:
KAPCA_BOVIN PRKACA cAMP-Dependent Protein Kinase (PKA) Mutant PKAR1 (1) | cAMP-dependent protein kinase, alpha-catalytic subunit
Type:
Enzyme Catalytic Subunit
Mol. Mass.:
40627.77
Organism:
Bos taurus (bovine)
Description:
P00517[L49I]
Residue:
351
  
Inhibitor
Name:
BDBM14030
Synonyms:
KT5720 | hexyl (15R,16S,18S)-16-hydroxy-15-methyl-3-oxo-28-oxa-4,14,19-triazaoctacyclo[12.11.2.1^{15,18}.0^{2,6}.0^{7,27}.0^{8,13}.0^{19,26}.0^{20,25}]octacosa-1(26),2(6),7(27),8(13),9,11,20(25),21,23-nonaene-16-carboxylate
Type:
Small organic molecule
Emp. Form.:
C32H31N3O5
Mol. Mass.:
537.6056
SMILES:
[H][C@@]12C[C@@](O)(C(=O)OCCCCCC)[C@@](C)(O1)n1c3ccccc3c3c4CNC(=O)c4c4c5ccccc5n2c4c13
:
Substrate
Name:
Kemptide
Synonyms:
Aurora Peptide Substrate
Type:
Peptide
Mol. Mass.:
773.92
Organism:
Description:
50 uM ATP as co-substrate.
Residue:
7
LRRASLG