Target
cAMP-dependent protein kinase catalytic subunit alpha [L49I,V123M,Q181K,T183A]
Ligand
BDBM14027
Substrate
Kemptide
Meas. Tech.
Kinase Activity Assay
IC50
1127±n/a nM
Citation
 Bonn, SHerrero, SBreitenlechner, CBErlbruch, ALehmann, WEngh, RAGassel, MBossemeyer, D Structural analysis of protein kinase A mutants with Rho-kinase inhibitor specificity. J Biol Chem 281:24818-30 (2006)  
Target
Name:
cAMP-dependent protein kinase catalytic subunit alpha [L49I,V123M,Q181K,T183A]
Synonyms:
KAPCA_BOVIN PRKACA cAMP-Dependent Protein Kinase (PKA) Mutant PKAR4 | cAMP-dependent protein kinase, alpha-catalytic subunit
Type:
Enzyme Catalytic Subunit
Mol. Mass.:
40630.86
Organism:
Bos taurus (bovine)
Description:
P00517[L49I,V123M,Q181K,T183A]
Residue:
351
  
Inhibitor
Name:
BDBM14027
Synonyms:
5-(1,4-diazepan-1-ylsulfonyl)isoquinoline AT877 CHEMBL541388 HA-1077 cid_163751
Type:
Small organic molecule
Emp. Form.:
C14H17N3O2S
Mol. Mass.:
291.369
SMILES:
O=S(=O)(N1CCCNCC1)c1cccc2cnccc12
:
Substrate
Name:
Kemptide
Synonyms:
Aurora Peptide Substrate
Type:
Peptide
Mol. Mass.:
773.92
Organism:
Description:
50 uM ATP as co-substrate.
Residue:
7
LRRASLG