Target
Rho-associated protein kinase 2
Ligand
BDBM14027
Substrate
Kemptide
Meas. Tech.
Kinase Activity Assay
IC50
485±n/a nM
Citation
 Bonn, SHerrero, SBreitenlechner, CBErlbruch, ALehmann, WEngh, RAGassel, MBossemeyer, D Structural analysis of protein kinase A mutants with Rho-kinase inhibitor specificity. J Biol Chem 281:24818-30 (2006)  
Target
Name:
Rho-associated protein kinase 2
Synonyms:
ROCK2 Rho-associated, coiled-coil-containing protein kinase 2 p164 ROCK-2
Type:
Kinase Domain
Mol. Mass.:
160784.81
Organism:
Bos taurus (bovine)
Description:
Q28021
Residue:
1388
  
Inhibitor
Name:
BDBM14027
Synonyms:
5-(1,4-diazepan-1-ylsulfonyl)isoquinoline AT877 CHEMBL541388 HA-1077 cid_163751
Type:
Small organic molecule
Emp. Form.:
C14H17N3O2S
Mol. Mass.:
291.369
SMILES:
O=S(=O)(N1CCCNCC1)c1cccc2cnccc12
:
Substrate
Name:
Kemptide
Synonyms:
Aurora Peptide Substrate
Type:
Peptide
Mol. Mass.:
773.92
Organism:
Description:
50 uM ATP as co-substrate.
Residue:
7
LRRASLG