Target
Fibroblast growth factor receptor 3
Ligand
BDBM339804
Substrate
Meas. Tech.
FGFR3 (Enzymatic Assay)
IC50
0.631±n/a nM
Citation
 Angibaud, PRObringer, MMarin, JJJeanty, M Naphthyridine derivative compounds US Patent  US9757364 Publication Date 9/12/2017 
Target
Name:
Fibroblast growth factor receptor 3
Synonyms:
CD_antigen: CD333 FGFR3 Fibroblast growth factor receptor JTK4
Type:
Protein
Mol. Mass.:
87699.57
Organism:
Homo sapiens (Human)
Description:
P22607
Residue:
806
  
Inhibitor
Name:
BDBM339804
Synonyms:
US9757364, Compound 2
Type:
Small organic molecule
Emp. Form.:
C23H25N5O3
Mol. Mass.:
419.4763
SMILES:
COc1cc(OC)cc(c1)N(CCCO)c1ccc2ncc(cc2n1)-c1cnn(C)c1
: