Target
Fibroblast growth factor receptor 1
Ligand
BDBM339825
Substrate
Meas. Tech.
FGFR1 (Enzymatic Assay)
IC50
0.676±n/a nM
Citation
 Angibaud, PRObringer, MMarin, JJJeanty, M Naphthyridine derivative compounds US Patent  US9757364 Publication Date 9/12/2017 
Target
Name:
Fibroblast growth factor receptor 1
Synonyms:
BFGFR Basic fibroblast growth factor receptor 1 (FGFR1) CEK FGFR-1 FGFR-1, (FL) FGFR1_HUMAN FLT2 Fibroblast growth factor receptor 1 (FGFR-1) Fms-like tyrosine kinase 2 N-sam bFGF-R | c-fgr
Type:
Receptor
Mol. Mass.:
91861.70
Organism:
Homo sapiens (Human)
Description:
P11362
Residue:
822
  
Inhibitor
Name:
BDBM339825
Synonyms:
US9757364, Compound 31
Type:
Small organic molecule
Emp. Form.:
C25H28N6O2
Mol. Mass.:
444.5288
SMILES:
COc1cc(OC)cc(c1)N(C1CCNCC1)c1ccc2ncc(cc2n1)-c1cnn(C)c1
: