Target
Fibroblast growth factor receptor 4
Ligand
BDBM339830
Substrate
Meas. Tech.
FGFR4 (Enzymatic Assay)
IC50
6.61±n/a nM
Citation
 Angibaud, PRObringer, MMarin, JJJeanty, M Naphthyridine derivative compounds US Patent  US9757364 Publication Date 9/12/2017 
Target
Name:
Fibroblast growth factor receptor 4
Synonyms:
CD_antigen: CD334 FGFR4 FGFR4 Fibroblast growth factor receptor JK2 TKF
Type:
Protein
Mol. Mass.:
87957.45
Organism:
Homo sapiens (Human)
Description:
P22455
Residue:
802
  
Inhibitor
Name:
BDBM339830
Synonyms:
US9757364, Compound 28
Type:
Small organic molecule
Emp. Form.:
C25H29FN6O2
Mol. Mass.:
464.5352
SMILES:
COc1cc(OC)c(F)c(c1)\N=c1/ccc2ncc(cc2n1CCNC(C)C)-c1cnn(C)c1
: