Target
Fibroblast growth factor receptor 4
Ligand
BDBM339871
Substrate
Meas. Tech.
FGFR4 (Enzymatic Assay)
IC50
1.48±n/a nM
Citation
 Angibaud, PRObringer, MMarin, JJJeanty, M Naphthyridine derivative compounds US Patent  US9757364 Publication Date 9/12/2017 
Target
Name:
Fibroblast growth factor receptor 4
Synonyms:
CD_antigen: CD334 FGFR4 FGFR4 Fibroblast growth factor receptor JK2 TKF
Type:
Protein
Mol. Mass.:
87957.45
Organism:
Homo sapiens (Human)
Description:
P22455
Residue:
802
  
Inhibitor
Name:
BDBM339871
Synonyms:
US9757364, Compound 55
Type:
Small organic molecule
Emp. Form.:
C24H22FN7O2
Mol. Mass.:
459.4756
SMILES:
COc1cc(OC)c(F)c(c1)N(Cc1cc[nH]n1)c1ccc2ncc(cc2n1)-c1cnn(C)c1
: