Target
Muscarinic acetylcholine receptor M3
Ligand
BDBM200755
Substrate
Meas. Tech.
Receptors Binding Assay
IC50
3.60±n/a nM
Citation
 Aiguade Bosch, JGual Roig, SPrat Quinones, MPuig Duran, C Cyclohexylamine derivatives having β2 adrenergic agonist and M3 muscarinic antagonist activities US Patent  US9757383 Publication Date 9/12/2017 
Target
Name:
Muscarinic acetylcholine receptor M3
Synonyms:
ACM3_HUMAN Cholinergic, muscarinic M3 Muscarinic receptor M3 | RecName: Full=Muscarinic acetylcholine receptor M3
Type:
Enzyme
Mol. Mass.:
66151.03
Organism:
Homo sapiens (Human)
Description:
P20309
Residue:
590
  
Inhibitor
Name:
BDBM200755
Synonyms:
US9233108, 20 | US9757383, Example 20
Type:
Small organic molecule
Emp. Form.:
C40H46N4O8S2
Mol. Mass.:
774.945
SMILES:
CC(Cc1ccc(OCC(=O)NCCN[C@H]2CC[C@@H](CC2)OC(=O)C(O)(c2cccs2)c2cccs2)cc1)NC[C@H](O)c1ccc(O)c2[nH]c(=O)ccc12
: