Target
Alpha-2A adrenergic receptor [16-465]
Ligand
BDBM13017
Substrate
BDBM14062
Meas. Tech.
alpha-Adrenoceptor Radioligand Binding Assay
pH
7.7±n/a
Temperature
298.15±n/a K
Ki
100000±20000 nM
Citation
 McMillan, FMArchbold, JMcLeish, MJCaine, JMCriscione, KRGrunewald, GLMartin, JL Molecular recognition of sub-micromolar inhibitors by the epinephrine-synthesizing enzyme phenylethanolamine N-methyltransferase. J Med Chem 47:37-44 (2004)  
Target
Name:
Alpha-2A adrenergic receptor [16-465]
Synonyms:
ADA2A_RAT Adrenaline 2 Alpha-2A adrenoceptor Alpha-2AAR Alpha2 Adrenoreceptor adrenergic Alpha2A
Type:
G-protein coupled receptor
Mol. Mass.:
48961.69
Organism:
Rattus norvegicus (rat)
Description:
P22909[16-465]
Residue:
450
  
Inhibitor
Name:
BDBM13017
Synonyms:
1,2,3,4-tetrahydroisoquinoline-7-sulfonamide SKF 29661
Type:
Small organic molecule
Emp. Form.:
C9H12N2O2S
Mol. Mass.:
212.269
SMILES:
NS(=O)(=O)c1ccc2CCNCc2c1
:
Substrate
Name:
BDBM14062
Synonyms:
Clonidine [3H]clonidine
Type:
Small organic molecule
Emp. Form.:
C9H9Cl2N3
Mol. Mass.:
230.094
SMILES:
Clc1cccc(Cl)c1\[#7]=[#6]-1/[#7]-[#6]-[#6]-[#7]-1
: