Target
P2X purinoceptor 7
Ligand
BDBM174792
Substrate
Meas. Tech.
Ca2+ Flux Assay
pH
7.4±n/a
Ki
5.00±n/a nM
IC50
56±n/a nM
Comments
extracted
Citation
 Letavic, MARudolph, DA P2X7 modulators US Patent  US9540388 Publication Date 1/10/2017 
Target
Name:
P2X purinoceptor 7
Synonyms:
ATP receptor P2X purinoceptor 7 P2X purinoceptor 7 (P2X7) P2X7 rat P2rx7 | Purinergic receptor
Type:
Protein
Mol. Mass.:
68403.50
Organism:
Rattus norvegicus (Rat)
Description:
Q64663
Residue:
595
  
Inhibitor
Name:
BDBM174792
Synonyms:
US10053462, 23 US9540388, 23
Type:
Small organic molecule
Emp. Form.:
C22H19ClF3N5O
Mol. Mass.:
461.867
SMILES:
Cc1cccc(n1)-c1nnc2[C@H]3CCC[C@@H](Cn12)N3C(=O)c1cccc(c1Cl)C(F)(F)F
: