Target
P2X purinoceptor 7
Ligand
BDBM174793
Substrate
Meas. Tech.
Ca2+ Flux Assay
pH
7.4±n/a
Ki
5.00±n/a nM
IC50
3698±n/a nM
Comments
extracted
Citation
 Letavic, MARudolph, DA P2X7 modulators US Patent  US9540388 Publication Date 1/10/2017 
Target
Name:
P2X purinoceptor 7
Synonyms:
ATP receptor P2RX7_HUMAN P2X purinoceptor 7 (P2X7) P2Z receptor | Purinergic receptor
Type:
Protein
Mol. Mass.:
68602.85
Organism:
Homo sapiens (Human)
Description:
Q99572
Residue:
595
  
Inhibitor
Name:
BDBM174793
Synonyms:
US10053462, 24 US9540388, 24
Type:
Small organic molecule
Emp. Form.:
C22H19ClF3N5O
Mol. Mass.:
461.867
SMILES:
Cc1cccc(n1)-c1nnc2[C@@H]3CCC[C@H](Cn12)N3C(=O)c1cccc(c1Cl)C(F)(F)F
: