Target
P2X purinoceptor 7
Ligand
BDBM174795
Substrate
Meas. Tech.
Radioligand Binding Assay
Ki
30±n/a nM
IC50
>10000±n/a nM
Citation
 Letavic, MARudolph, DA P2X7 modulators US Patent  US9540388 Publication Date 1/10/2017 
Target
Name:
P2X purinoceptor 7
Synonyms:
ATP receptor P2RX7_HUMAN P2X purinoceptor 7 (P2X7) P2Z receptor | Purinergic receptor
Type:
Protein
Mol. Mass.:
68602.85
Organism:
Homo sapiens (Human)
Description:
Q99572
Residue:
595
  
Inhibitor
Name:
BDBM174795
Synonyms:
US10053462, 26 US9540388, 26
Type:
Small organic molecule
Emp. Form.:
C22H19ClF3N5O2
Mol. Mass.:
477.867
SMILES:
COc1ccnc(c1)-c1nnc2[C@H]3CCC[C@@H](Cn12)N3C(=O)c1cccc(c1Cl)C(F)(F)F
: