Target
P2X purinoceptor 7
Ligand
BDBM174815
Substrate
Meas. Tech.
Radioligand Binding Assay
Ki
6.30±n/a nM
IC50
15812±n/a nM
Citation
 Letavic, MARudolph, DA P2X7 modulators US Patent  US9540388 Publication Date 1/10/2017 
Target
Name:
P2X purinoceptor 7
Synonyms:
ATP receptor P2X purinoceptor 7 P2X purinoceptor 7 (P2X7) P2X7 rat P2rx7 | Purinergic receptor
Type:
Protein
Mol. Mass.:
68403.50
Organism:
Rattus norvegicus (Rat)
Description:
Q64663
Residue:
595
  
Inhibitor
Name:
BDBM174815
Synonyms:
US10053462, 46 US9540388, 46
Type:
Small organic molecule
Emp. Form.:
C19H14ClF3N6O
Mol. Mass.:
434.802
SMILES:
FC(F)(F)c1cccc(C(=O)N2[C@H]3CC[C@@H]2c2nnc(-c4ncccn4)n2C3)c1Cl
: