Target
P2X purinoceptor 7
Ligand
BDBM174815
Substrate
Meas. Tech.
Ca2+ Flux Assay
pH
7.4±n/a
Ki
6.30±n/a nM
IC50
15±n/a nM
Comments
extracted
Citation
 Letavic, MARudolph, DA P2X7 modulators US Patent  US9540388 Publication Date 1/10/2017 
Target
Name:
P2X purinoceptor 7
Synonyms:
ATP receptor P2RX7_HUMAN P2X purinoceptor 7 (P2X7) P2Z receptor | Purinergic receptor
Type:
Protein
Mol. Mass.:
68602.85
Organism:
Homo sapiens (Human)
Description:
Q99572
Residue:
595
  
Inhibitor
Name:
BDBM174815
Synonyms:
US10053462, 46 US9540388, 46
Type:
Small organic molecule
Emp. Form.:
C19H14ClF3N6O
Mol. Mass.:
434.802
SMILES:
FC(F)(F)c1cccc(C(=O)N2[C@H]3CC[C@@H]2c2nnc(-c4ncccn4)n2C3)c1Cl
: