Target
P2X purinoceptor 7
Ligand
BDBM174827
Substrate
Meas. Tech.
Ca2+ Flux Assay
pH
7.4±n/a
Ki
10.00±n/a nM
IC50
713±n/a nM
Comments
extracted
Citation
 Letavic, MARudolph, DA P2X7 modulators US Patent  US9540388 Publication Date 1/10/2017 
Target
Name:
P2X purinoceptor 7
Synonyms:
ATP receptor P2X purinoceptor 7 P2X purinoceptor 7 (P2X7) P2X7 rat P2rx7 | Purinergic receptor
Type:
Protein
Mol. Mass.:
68403.50
Organism:
Rattus norvegicus (Rat)
Description:
Q64663
Residue:
595
  
Inhibitor
Name:
BDBM174827
Synonyms:
US10053462, 58 US9540388, 58
Type:
Small organic molecule
Emp. Form.:
C19H14ClF3N4OS
Mol. Mass.:
438.854
SMILES:
FC(F)(F)c1cccc(C(=O)N2[C@H]3CC[C@@H]2c2nnc(-c4ccsc4)n2C3)c1Cl
: