Target
Coagulation factor XI
Ligand
BDBM339874
Substrate
Meas. Tech.
Inhibition Assay
IC50
125±n/a nM
Citation
 Ikuma, YFukuda, NIwata, MKimura, HSuzuki, K 1-(cycloalkyl-carbonyl)proline derivative US Patent  US9758480 Publication Date 9/12/2017 
Target
Name:
Coagulation factor XI
Synonyms:
Coagulation factor XIa Coagulation factor XIa light chain FA11_HUMAN Factor XIa PTA | Plasma thromboplastin antecedent
Type:
Enzyme
Mol. Mass.:
70130.58
Organism:
Homo sapiens (Human)
Description:
P03951
Residue:
625
  
Inhibitor
Name:
BDBM339874
Synonyms:
5-{cis-1-[trans-4-(Aminomethyl)cyclohexanecarbonyl]-N-methyl-3-phenylpyrrolidine-2-carboxamide}-1H-indole-2-carboxylic acid trifluoroacetate | US9758480, 5
Type:
Small organic molecule
Emp. Form.:
C29H34N4O4
Mol. Mass.:
502.6047
SMILES:
CN(C(=O)C1C(CCN1C(=O)[C@H]1CC[C@H](CN)CC1)c1ccccc1)c1ccc2[nH]c(cc2c1)C(O)=O
: