Target
Coagulation factor XI
Ligand
BDBM339899
Substrate
Meas. Tech.
Inhibition Assay
IC50
6.00±n/a nM
Citation
 Ikuma, YFukuda, NIwata, MKimura, HSuzuki, K 1-(cycloalkyl-carbonyl)proline derivative US Patent  US9758480 Publication Date 9/12/2017 
Target
Name:
Coagulation factor XI
Synonyms:
Coagulation factor XIa Coagulation factor XIa light chain FA11_HUMAN Factor XIa PTA | Plasma thromboplastin antecedent
Type:
Enzyme
Mol. Mass.:
70130.58
Organism:
Homo sapiens (Human)
Description:
P03951
Residue:
625
  
Inhibitor
Name:
BDBM339899
Synonyms:
(3S)-1-[(trans-4-{(1S)-1-[(tert-Butoxycarbonyl)amino]-2-fluoroethyl}cyclohexyl)carbonyl]-3-cyclohexyl-N-{4-[(4,5-dimethyl-1,3-oxazol-2-yl)sulfamoyl]phenyl}-L-prolinamide | US9758480, 99
Type:
Small organic molecule
Emp. Form.:
C29H39FN4O4
Mol. Mass.:
526.6428
SMILES:
N[C@H](CF)[C@H]1CC[C@@H](CC1)C(=O)N1CC[C@H]([C@H]1C(=O)Nc1ccc2[nH]c(cc2c1)C(O)=O)C1CCCCC1
: