Target
Coagulation factor XI
Ligand
BDBM339904
Substrate
Meas. Tech.
Inhibition Assay
IC50
1500±n/a nM
Citation
 Ikuma, YFukuda, NIwata, MKimura, HSuzuki, K 1-(cycloalkyl-carbonyl)proline derivative US Patent  US9758480 Publication Date 9/12/2017 
Target
Name:
Coagulation factor XI
Synonyms:
Coagulation factor XIa Coagulation factor XIa light chain FA11_HUMAN Factor XIa PTA | Plasma thromboplastin antecedent
Type:
Enzyme
Mol. Mass.:
70130.58
Organism:
Homo sapiens (Human)
Description:
P03951
Residue:
625
  
Inhibitor
Name:
BDBM339904
Synonyms:
US9758480, 115
Type:
Small organic molecule
Emp. Form.:
C29H40FN5O3
Mol. Mass.:
525.658
SMILES:
Cc1noc(n1)-c1ccc(NC(=O)[C@@H]2[C@@H](CCN2C(=O)[C@H]2CC[C@@H](CC2)[C@H](N)CF)C2CCCCC2)cc1
: