Target
Coagulation factor XI
Ligand
BDBM339907
Substrate
Meas. Tech.
Inhibition Assay
IC50
690±n/a nM
Citation
 Ikuma, YFukuda, NIwata, MKimura, HSuzuki, K 1-(cycloalkyl-carbonyl)proline derivative US Patent  US9758480 Publication Date 9/12/2017 
Target
Name:
Coagulation factor XI
Synonyms:
Coagulation factor XIa Coagulation factor XIa light chain FA11_HUMAN Factor XIa PTA | Plasma thromboplastin antecedent
Type:
Enzyme
Mol. Mass.:
70130.58
Organism:
Homo sapiens (Human)
Description:
P03951
Residue:
625
  
Inhibitor
Name:
BDBM339907
Synonyms:
US9758480, 122
Type:
Small organic molecule
Emp. Form.:
C33H40FN5O7S
Mol. Mass.:
669.763
SMILES:
N[C@H](CF)[C@H]1CC[C@@H](CC1)C(=O)N1CC[C@@H]([C@H]1C(=O)Nc1ccc2oc(cc2c1)C(=O)NS(=O)(=O)N1CCOCC1)c1ccccc1
: