Target
Coagulation factor XI
Ligand
BDBM339916
Substrate
Meas. Tech.
Inhibition Assay
IC50
140±n/a nM
Citation
 Ikuma, YFukuda, NIwata, MKimura, HSuzuki, K 1-(cycloalkyl-carbonyl)proline derivative US Patent  US9758480 Publication Date 9/12/2017 
Target
Name:
Coagulation factor XI
Synonyms:
Coagulation factor XIa Coagulation factor XIa light chain FA11_HUMAN Factor XIa PTA | Plasma thromboplastin antecedent
Type:
Enzyme
Mol. Mass.:
70130.58
Organism:
Homo sapiens (Human)
Description:
P03951
Residue:
625
  
Inhibitor
Name:
BDBM339916
Synonyms:
US9758480, 148
Type:
Small organic molecule
Emp. Form.:
C29H40FN5O4S
Mol. Mass.:
573.722
SMILES:
COC(=O)Nc1nc2ccc(NC(=O)[C@@H]3[C@@H](CCN3C(=O)[C@H]3CC[C@@H](CC3)[C@H](N)CF)C3CCCCC3)cc2s1
: