Target
Coagulation factor XI
Ligand
BDBM339917
Substrate
Meas. Tech.
Inhibition Assay
IC50
76.0±n/a nM
Citation
 Ikuma, YFukuda, NIwata, MKimura, HSuzuki, K 1-(cycloalkyl-carbonyl)proline derivative US Patent  US9758480 Publication Date 9/12/2017 
Target
Name:
Coagulation factor XI
Synonyms:
Coagulation factor XIa Coagulation factor XIa light chain FA11_HUMAN Factor XIa PTA | Plasma thromboplastin antecedent
Type:
Enzyme
Mol. Mass.:
70130.58
Organism:
Homo sapiens (Human)
Description:
P03951
Residue:
625
  
Inhibitor
Name:
BDBM339917
Synonyms:
US9758480, 170
Type:
Small organic molecule
Emp. Form.:
C29H33FN4O4
Mol. Mass.:
520.5951
SMILES:
N[C@H](CF)[C@H]1CC[C@@H](CC1)C(=O)N1CC[C@@H]([C@H]1C(=O)Nc1ccc2[nH]c(cc2c1)C(O)=O)c1ccccc1
: