Target
Sodium channel protein type 10 subunit alpha
Ligand
BDBM161251
Substrate
Meas. Tech.
Electrophysiology Assay
IC50
101±n/a nM
Citation
 Hadida-Ruah, SSAnderson, CArumugam, VAsgian, ILBear, BRTermin, APJohnson, JP Pyridone amides as modulators of sodium channels US Patent  US9758483 Publication Date 9/12/2017 
Target
Name:
Sodium channel protein type 10 subunit alpha
Synonyms:
PN3 SCN10A Sodium channel alpha subunit Sodium channel protein type X alpha subunit fret-membrane potential nav1.8 | hPN3
Type:
Enzyme
Mol. Mass.:
220609.21
Organism:
Homo sapiens (Human)
Description:
Q9Y5Y9
Residue:
1956
  
Inhibitor
Name:
BDBM161251
Synonyms:
US10087143, Compound 36 US11673864, Compound 36 US9758483, Compound 36
Type:
Small organic molecule
Emp. Form.:
C20H15F3N2O4
Mol. Mass.:
404.3393
SMILES:
Cc1ccccc1Oc1ccc(OC(F)(F)F)cc1C(=O)Nc1cc[nH]c(=O)c1
: