Target
Sodium channel protein type 10 subunit alpha
Ligand
BDBM161276
Substrate
Meas. Tech.
Electrophysiology Assay
IC50
113±n/a nM
Citation
 Hadida-Ruah, SSAnderson, CArumugam, VAsgian, ILBear, BRTermin, APJohnson, JP Pyridone amides as modulators of sodium channels US Patent  US9758483 Publication Date 9/12/2017 
Target
Name:
Sodium channel protein type 10 subunit alpha
Synonyms:
PN3 SCN10A Sodium channel alpha subunit Sodium channel protein type X alpha subunit fret-membrane potential nav1.8 | hPN3
Type:
Enzyme
Mol. Mass.:
220609.21
Organism:
Homo sapiens (Human)
Description:
Q9Y5Y9
Residue:
1956
  
Inhibitor
Name:
BDBM161276
Synonyms:
US10087143, Compound 61 US11673864, Compound 61 US9758483, Compound 61
Type:
Small organic molecule
Emp. Form.:
C21H16F4N2O3
Mol. Mass.:
420.357
SMILES:
Cc1cc(NC(=O)c2cc(ccc2Oc2ccc(F)cc2C)C(F)(F)F)cc(=O)[nH]1
: