Target
Sodium channel protein type 10 subunit alpha
Ligand
BDBM161289
Substrate
Meas. Tech.
Electrophysiology Assay
IC50
5175±n/a nM
Citation
 Hadida-Ruah, SSAnderson, CArumugam, VAsgian, ILBear, BRTermin, APJohnson, JP Pyridone amides as modulators of sodium channels US Patent  US9758483 Publication Date 9/12/2017 
Target
Name:
Sodium channel protein type 10 subunit alpha
Synonyms:
PN3 SCN10A Sodium channel alpha subunit Sodium channel protein type X alpha subunit fret-membrane potential nav1.8 | hPN3
Type:
Enzyme
Mol. Mass.:
220609.21
Organism:
Homo sapiens (Human)
Description:
Q9Y5Y9
Residue:
1956
  
Inhibitor
Name:
BDBM161289
Synonyms:
US10087143, Compound 74 US11673864, Compound 74 US9758483, Compound 74
Type:
Small organic molecule
Emp. Form.:
C20H12F6N2O3
Mol. Mass.:
442.3113
SMILES:
FC(F)(F)c1ccc(Oc2ccc(cc2C(=O)Nc2cc[nH]c(=O)c2)C(F)(F)F)cc1
: