Target
Sodium channel protein type 10 subunit alpha
Ligand
BDBM161246
Substrate
Meas. Tech.
Electrophysiology Assay
IC50
99.0±n/a nM
Citation
 Hadida-Ruah, SSAnderson, CArumugam, VAsgian, ILBear, BRTermin, APJohnson, JP Pyridone amides as modulators of sodium channels US Patent  US9758483 Publication Date 9/12/2017 
Target
Name:
Sodium channel protein type 10 subunit alpha
Synonyms:
PN3 SCN10A Sodium channel alpha subunit Sodium channel protein type X alpha subunit fret-membrane potential nav1.8 | hPN3
Type:
Enzyme
Mol. Mass.:
220609.21
Organism:
Homo sapiens (Human)
Description:
Q9Y5Y9
Residue:
1956
  
Inhibitor
Name:
BDBM161246
Synonyms:
US10087143, Compound 106 US10787472, Compound 10a US9051270, 106 US9163042, 10a | US9758483, Compound 106
Type:
Small organic molecule
Emp. Form.:
C20H14F4N2O3
Mol. Mass.:
406.3304
SMILES:
Cc1cc(F)ccc1Oc1ccc(cc1C(=O)Nc1cc[nH]c(=O)c1)C(F)(F)F
: