Target
Sodium channel protein type 10 subunit alpha
Ligand
BDBM161355
Substrate
Meas. Tech.
Electrophysiology Assay
IC50
15000±n/a nM
Citation
 Hadida-Ruah, SSAnderson, CArumugam, VAsgian, ILBear, BRTermin, APJohnson, JP Pyridone amides as modulators of sodium channels US Patent  US9758483 Publication Date 9/12/2017 
Target
Name:
Sodium channel protein type 10 subunit alpha
Synonyms:
PN3 SCN10A Sodium channel alpha subunit Sodium channel protein type X alpha subunit fret-membrane potential nav1.8 | hPN3
Type:
Enzyme
Mol. Mass.:
220609.21
Organism:
Homo sapiens (Human)
Description:
Q9Y5Y9
Residue:
1956
  
Inhibitor
Name:
BDBM161355
Synonyms:
US10738009, Compound 140 US9051270, 140 | US9758483, Compound 140
Type:
Small organic molecule
Emp. Form.:
C19H19F3N2O4
Mol. Mass.:
396.3604
SMILES:
CC1(C)CC1COc1ccc(OC(F)(F)F)cc1C(=O)Nc1cc[nH]c(=O)c1
: