Target
Lysine-specific demethylase 4C
Ligand
BDBM340045
Substrate
Meas. Tech.
In Vitro Enzyme Inhibition Assay
IC50
550±n/a nM
Citation
 Chen, YKWallace, MB Histone demethylase inhibitors US Patent  US9758517 Publication Date 9/12/2017 
Target
Name:
Lysine-specific demethylase 4C
Synonyms:
GASC-1 protein Gene amplified in squamous cell carcinoma 1 protein JMJD2C Jumonji domain-containing protein 2C KDM4C_HUMAN | KIAA0780
Type:
Protein
Mol. Mass.:
119979.01
Organism:
Homo sapiens (Human)
Description:
Q9H3R0
Residue:
1056
  
Inhibitor
Name:
BDBM340045
Synonyms:
2-(5-Cyclopropyl-2-methyl-2H-indazol-3-yl)-1H-pyrrolo[3,2-b]pyridine-7-carboxylic acid US9758517, Example 6
Type:
Small organic molecule
Emp. Form.:
C19H16N4O2
Mol. Mass.:
332.3559
SMILES:
Cn1nc2ccc(cc2c1-c1cc2nccc(C(O)=O)c2[nH]1)C1CC1
: